← mined_baseline

fastapi_11867

failed NO_PATCH NO_PATCH UNSUBMITTED empty_patch(None) · None tool calls · 0 s · fastapi/fastapi

Task input

(not found in data/tasks.jsonl)

Tool calls (0)

#ToolArgumentsResult
No trace captured.

Test output

show
.......F
=================================== FAILURES ===================================
___________________ test_allow_inf_nan_param_false[inf-422] ____________________

value = 'inf', code = 422

    @pytest.mark.parametrize(
        "value,code",
        [
            ("-1", 200),
            ("inf", 422),
            ("-inf", 422),
            ("nan", 422),
            ("0", 200),
            ("342", 200),
        ],
    )
    def test_allow_inf_nan_param_false(value: str, code: int):
        response = client.post(f"/?y={value}")
>       assert response.status_code == code, response.text
E       AssertionError: "OK"
E       assert 200 == 422
E        +  where 200 = <Response [200 OK]>.status_code

tests/test_allow_inf_nan_in_enforcing.py:51: AssertionError
=============================== warnings summary ===============================
../../../../../../Users/jp/repos/kaggle-gemini-coding-agent-post-training/.envs/overlays/starlette-0.38.6-py3-none-any/starlette/formparsers.py:12
  /Users/jp/repos/kaggle-gemini-coding-agent-post-training/.envs/overlays/starlette-0.38.6-py3-none-any/starlette/formparsers.py:12: PendingDeprecationWarning: Please use `import python_multipart` instead.
    import multipart

../../../../../../Users/jp/repos/kaggle-gemini-coding-agent-post-training/.envs/overlays/starlette-0.38.6-py3-none-any/starlette/testclient.py:40
  /Users/jp/repos/kaggle-gemini-coding-agent-post-training/.envs/overlays/starlette-0.38.6-py3-none-any/starlette/testclient.py:40: DeprecationWarning: The anyio.abc.BlockingPortal alias is deprecated, use anyio.from_thread.BlockingPortal instead.
    _PortalFactoryType = typing.Callable[[], typing.ContextManager[anyio.abc.BlockingPortal]]

-- Docs: https://docs.pytest.org/en/stable/how-to/capture-warnings.html
!!!!!!!!!!!!!!!!!!!!!!!!!! stopping after 1 failures !!!!!!!!!!!!!!!!!!!!!!!!!!!
1 failed, 7 passed, 2 warnings in 0.57s