← mined_baseline

fastapi_15515

failed NO_PATCH NO_PATCH UNSUBMITTED empty_patch(None) · None tool calls · 0 s · fastapi/fastapi

Task input

(not found in data/tasks.jsonl)

Tool calls (0)

#ToolArgumentsResult
No trace captured.

Test output

show
..........................F
=================================== FAILURES ===================================
_ test_format_sse_event_splitlines_behavior_in_data[Hello\n-data: Hello\ndata: \n\n] _

data = 'Hello\n', expected_result = b'data: Hello\ndata: \n\n'

    @pytest.mark.parametrize(
        ("data", "expected_result"),
        [
            ("Hello\n", b"data: Hello\ndata: \n\n"),
            ("Hello\n\n", b"data: Hello\ndata: \ndata: \n\n"),
            ("\n", b"data: \ndata: \n\n"),
            ("Hello\r\nWorld", b"data: Hello\ndata: World\n\n"),
            ("Hello\rWorld", b"data: Hello\ndata: World\n\n"),
            ("A\u2028B", "data: A\u2028B\n\n".encode()),
            ("A\vB", b"data: A\x0bB\n\n"),
            ("", b"data: \n\n"),
        ],
    )
    def test_format_sse_event_splitlines_behavior_in_data(
        data: str, expected_result: bytes
    ) -> None:
>       assert format_sse_event(data_str=data) == expected_result
E       AssertionError: assert b'data: Hello\n\n' == b'data: Hello\ndata: \n\n'
E         
E         At index 12 diff: b'\n' != b'd'
E         Use -v to get more diff

tests/test_sse.py:392: AssertionError
=============================== warnings summary ===============================
../../../../../../Users/jp/repos/kaggle-gemini-coding-agent-post-training/.envs/overlays/starlette-1.6.0-py3-none-any/starlette/testclient.py:53
  /Users/jp/repos/kaggle-gemini-coding-agent-post-training/.envs/overlays/starlette-1.6.0-py3-none-any/starlette/testclient.py:53: DeprecationWarning: The anyio.abc.BlockingPortal alias is deprecated, use anyio.from_thread.BlockingPortal instead.
    _PortalFactoryType = Callable[[], AbstractContextManager[anyio.abc.BlockingPortal]]

-- Docs: https://docs.pytest.org/en/stable/how-to/capture-warnings.html
!!!!!!!!!!!!!!!!!!!!!!!!!! stopping after 1 failures !!!!!!!!!!!!!!!!!!!!!!!!!!!
1 failed, 26 passed, 1 warning in 1.38s