← mined_baseline

rich_2088

failed NO_PATCH NO_PATCH UNSUBMITTED empty_patch(None) · None tool calls · 0 s · Textualize/rich

Task input

(not found in data/tasks.jsonl)

Tool calls (0)

#ToolArgumentsResult
No trace captured.

Test output

show
.........F
=================================== FAILURES ===================================
_______________________________ test_render_size _______________________________

    def test_render_size():
        console = Console(width=63, height=46, legacy_windows=False)
        options = console.options.update_dimensions(80, 4)
        lines = console.render_lines(Panel("foo", title="Hello"), options=options)
        print(repr(lines))
        expected = [
            [
                Segment("╭─", Style()),
                Segment(
                    "────────────────────────────────── Hello ───────────────────────────────────"
                ),
                Segment("─╮", Style()),
            ],
            [
                Segment("│", Style()),
                Segment(" ", Style()),
                Segment("foo"),
                Segment(
                    "                                                                         "
                ),
                Segment(" ", Style()),
                Segment("│", Style()),
            ],
            [
                Segment("│", Style()),
                Segment(" ", Style()),
                Segment(
                    "                                                                            ",
                    Style(),
                ),
                Segment(" ", Style()),
                Segment("│", Style()),
            ],
            [
                Segment(
                    "╰──────────────────────────────────────────────────────────────────────────────╯",
                    Style(),
                )
            ],
        ]
>       assert lines == expected
E       AssertionError: assert [[Segment('╭─...╯', Style())]] == [[Segment('╭─...╯', Style())]]
E         
E         At index 0 diff: [Segment('╭─', Style()), Segment('────────────────────────────────── Hello ──────────────────────'), Segment('─╮', Style()), Segment('             ')] != [Segment('╭─', Style()), Segment('────────────────────────────────── Hello ───────────────────────────────────'), Segment('─╮', Style())]
E         Use -v to get more diff

tests/test_panel.py:98: AssertionError
----------------------------- Captured stdout call -----------------------------
[[Segment('╭─', Style()), Segment('────────────────────────────────── Hello ──────────────────────'), Segment('─╮', Style()), Segment('             ')], [Segment('│', Style()), Segment(' ', Style()), Segment('foo'), Segment('                                                                         '), Segment(' ', Style()), Segment('│', Style())], [Segment('│', Style()), Segment(' ', Style()), Segment('                                                                            ', Style()), Segment(' ', Style()), Segment('│', Style())], [Segment('╰──────────────────────────────────────────────────────────────────────────────╯', Style())]]
!!!!!!!!!!!!!!!!!!!!!!!!!! stopping after 1 failures !!!!!!!!!!!!!!!!!!!!!!!!!!!
1 failed, 9 passed in 0.10s