← mined_baseline

rich_2659

failed NO_PATCH NO_PATCH UNSUBMITTED empty_patch(None) · None tool calls · 0 s · Textualize/rich

Task input

(not found in data/tasks.jsonl)

Tool calls (0)

#ToolArgumentsResult
No trace captured.

Test output

show
...................F
=================================== FAILURES ===================================
__________________________________ test_track __________________________________

    def test_track() -> None:
    
        console = Console(
            file=io.StringIO(),
            force_terminal=True,
            width=60,
            color_system="truecolor",
            legacy_windows=False,
            _environ={},
        )
        test = ["foo", "bar", "baz"]
        expected_values = iter(test)
        for value in track(
            test, "test", console=console, auto_refresh=False, get_time=MockClock(auto=True)
        ):
            assert value == next(expected_values)
        result = console.file.getvalue()
        print(repr(result))
        expected = "\x1b[?25l\r\x1b[2Ktest \x1b[38;5;237m━━━━━━━━━━━━━━━━━━━━━━━━━━━━━━━━━━━━━━━━\x1b[0m \x1b[35m  0%\x1b[0m \x1b[36m-:--:--\x1b[0m\r\x1b[2Ktest \x1b[38;2;249;38;114m━━━━━━━━━━━━━\x1b[0m\x1b[38;5;237m╺\x1b[0m\x1b[38;5;237m━━━━━━━━━━━━━━━━━━━━━━━━━━\x1b[0m \x1b[35m 33%\x1b[0m \x1b[36m-:--:--\x1b[0m\r\x1b[2Ktest \x1b[38;2;249;38;114m━━━━━━━━━━━━━━━━━━━━━━━━━━\x1b[0m\x1b[38;2;249;38;114m╸\x1b[0m\x1b[38;5;237m━━━━━━━━━━━━━\x1b[0m \x1b[35m 67%\x1b[0m \x1b[36m0:00:06\x1b[0m\r\x1b[2Ktest \x1b[38;2;114;156;31m━━━━━━━━━━━━━━━━━━━━━━━━━━━━━━━━━━━━━━━━\x1b[0m \x1b[35m100%\x1b[0m \x1b[33m0:00:19\x1b[0m\r\x1b[2Ktest \x1b[38;2;114;156;31m━━━━━━━━━━━━━━━━━━━━━━━━━━━━━━━━━━━━━━━━\x1b[0m \x1b[35m100%\x1b[0m \x1b[33m0:00:19\x1b[0m\n\x1b[?25h"
        print("--")
        print("RESULT:")
        print(result)
        print(repr(result))
        print("EXPECTED:")
        print(expected)
        print(repr(expected))
    
>       assert result == expected
E       AssertionError: assert '\x1b[?25l\r\...0m\n\x1b[?25h' == '\x1b[?25l\r\...0m\n\x1b[?25h'
E         
E         Skipping 455 identical leading characters in diff, use -v to show
E         - 0% 0:00:19
E         ?           ^      ^^
E         + 0% 0:00:00
E         ?           ^      ^^
E         - test ━━━━━━━━━━━━━━━━━━━━━━━━━━━━━━━━━━━━━━━━ 100% 0:00:19...
E         
E         ...Full output truncated (4 lines hidden), use '-vv' to show

tests/test_progress.py:309: AssertionError
----------------------------- Captured stdout call -----------------------------
'\x1b[?25l\r\x1b[2Ktest \x1b[38;5;237m━━━━━━━━━━━━━━━━━━━━━━━━━━━━━━━━━━━━━━━━\x1b[0m \x1b[35m  0%\x1b[0m \x1b[36m-:--:--\x1b[0m\r\x1b[2Ktest \x1b[38;2;249;38;114m━━━━━━━━━━━━━\x1b[0m\x1b[38;5;237m╺\x1b[0m\x1b[38;5;237m━━━━━━━━━━━━━━━━━━━━━━━━━━\x1b[0m \x1b[35m 33%\x1b[0m \x1b[36m-:--:--\x1b[0m\r\x1b[2Ktest \x1b[38;2;249;38;114m━━━━━━━━━━━━━━━━━━━━━━━━━━\x1b[0m\x1b[38;2;249;38;114m╸\x1b[0m\x1b[38;5;237m━━━━━━━━━━━━━\x1b[0m \x1b[35m 67%\x1b[0m \x1b[36m0:00:06\x1b[0m\r\x1b[2Ktest \x1b[38;2;114;156;31m━━━━━━━━━━━━━━━━━━━━━━━━━━━━━━━━━━━━━━━━\x1b[0m \x1b[35m100%\x1b[0m \x1b[36m0:00:00\x1b[0m\r\x1b[2Ktest \x1b[38;2;114;156;31m━━━━━━━━━━━━━━━━━━━━━━━━━━━━━━━━━━━━━━━━\x1b[0m \x1b[35m100%\x1b[0m \x1b[36m0:00:00\x1b[0m\n\x1b[?25h'
--
RESULT:
[?25l
test ━━━━━━━━━━━━━━━━━━━━━━━━━━━━━━━━━━━━━━━━   0% -:--:--
test ━━━━━━━━━━━━━╺━━━━━━━━━━━━━━━━━━━━━━━━━━  33% -:--:--
test ━━━━━━━━━━━━━━━━━━━━━━━━━━╸━━━━━━━━━━━━━  67% 0:00:06
test ━━━━━━━━━━━━━━━━━━━━━━━━━━━━━━━━━━━━━━━━ 100% 0:00:00
test ━━━━━━━━━━━━━━━━━━━━━━━━━━━━━━━━━━━━━━━━ 100% 0:00:00
[?25h
'\x1b[?25l\r\x1b[2Ktest \x1b[38;5;237m━━━━━━━━━━━━━━━━━━━━━━━━━━━━━━━━━━━━━━━━\x1b[0m \x1b[35m  0%\x1b[0m \x1b[36m-:--:--\x1b[0m\r\x1b[2Ktest \x1b[38;2;249;38;114m━━━━━━━━━━━━━\x1b[0m\x1b[38;5;237m╺\x1b[0m\x1b[38;5;237m━━━━━━━━━━━━━━━━━━━━━━━━━━\x1b[0m \x1b[35m 33%\x1b[0m \x1b[36m-:--:--\x1b[0m\r\x1b[2Ktest \x1b[38;2;249;38;114m━━━━━━━━━━━━━━━━━━━━━━━━━━\x1b[0m\x1b[38;2;249;38;114m╸\x1b[0m\x1b[38;5;237m━━━━━━━━━━━━━\x1b[0m \x1b[35m 67%\x1b[0m \x1b[36m0:00:06\x1b[0m\r\x1b[2Ktest \x1b[38;2;114;156;31m━━━━━━━━━━━━━━━━━━━━━━━━━━━━━━━━━━━━━━━━\x1b[0m \x1b[35m100%\x1b[0m \x1b[36m0:00:00\x1b[0m\r\x1b[2Ktest \x1b[38;2;114;156;31m━━━━━━━━━━━━━━━━━━━━━━━━━━━━━━━━━━━━━━━━\x1b[0m \x1b[35m100%\x1b[0m \x1b[36m0:00:00\x1b[0m\n\x1b[?25h'
EXPECTED:
[?25l
test ━━━━━━━━━━━━━━━━━━━━━━━━━━━━━━━━━━━━━━━━   0% -:--:--
test ━━━━━━━━━━━━━╺━━━━━━━━━━━━━━━━━━━━━━━━━━  33% -:--:--
test ━━━━━━━━━━━━━━━━━━━━━━━━━━╸━━━━━━━━━━━━━  67% 0:00:06
test ━━━━━━━━━━━━━━━━━━━━━━━━━━━━━━━━━━━━━━━━ 100% 0:00:19
test ━━━━━━━━━━━━━━━━━━━━━━━━━━━━━━━━━━━━━━━━ 100% 0:00:19
[?25h
'\x1b[?25l\r\x1b[2Ktest \x1b[38;5;237m━━━━━━━━━━━━━━━━━━━━━━━━━━━━━━━━━━━━━━━━\x1b[0m \x1b[35m  0%\x1b[0m \x1b[36m-:--:--\x1b[0m\r\x1b[2Ktest \x1b[38;2;249;38;114m━━━━━━━━━━━━━\x1b[0m\x1b[38;5;237m╺\x1b[0m\x1b[38;5;237m━━━━━━━━━━━━━━━━━━━━━━━━━━\x1b[0m \x1b[35m 33%\x1b[0m \x1b[36m-:--:--\x1b[0m\r\x1b[2Ktest \x1b[38;2;249;38;114m━━━━━━━━━━━━━━━━━━━━━━━━━━\x1b[0m\x1b[38;2;249;38;114m╸\x1b[0m\x1b[38;5;237m━━━━━━━━━━━━━\x1b[0m \x1b[35m 67%\x1b[0m \x1b[36m0:00:06\x1b[0m\r\x1b[2Ktest \x1b[38;2;114;156;31m━━━━━━━━━━━━━━━━━━━━━━━━━━━━━━━━━━━━━━━━\x1b[0m \x1b[35m100%\x1b[0m \x1b[33m0:00:19\x1b[0m\r\x1b[2Ktest \x1b[38;2;114;156;31m━━━━━━━━━━━━━━━━━━━━━━━━━━━━━━━━━━━━━━━━\x1b[0m \x1b[35m100%\x1b[0m \x1b[33m0:00:19\x1b[0m\n\x1b[?25h'
!!!!!!!!!!!!!!!!!!!!!!!!!! stopping after 1 failures !!!!!!!!!!!!!!!!!!!!!!!!!!!
1 failed, 19 passed in 0.14s