← mined_oracle

rich_2343

failed WRONG_FIX UNSUBMITTED wrong_fix_unsubmitted(None) · None tool calls · 0 s · Textualize/rich

Task input

(not found in data/tasks.jsonl)

Tool calls (0)

#ToolArgumentsResult
No trace captured.

Patch

--- a/CHANGELOG.md
+++ b/CHANGELOG.md
@@ -14,6 +14,7 @@ and this project adheres to [Semantic Versioning](https://semver.org/spec/v2.0.0
 - Allow exceptions that are raised while a Live is rendered to be displayed and/or processed https://github.com/Textualize/rich/pull/2305
 - Fix crashes that can happen with `inspect` when docstrings contain some special control codes https://github.com/Textualize/rich/pull/2294
 - Fix edges used in first row of tables when `show_header=False` https://github.com/Textualize/rich/pull/2330
+- Fix interaction between `Capture` contexts and `Console(record=True)` https://github.com/Textualize/rich/pull/2343
 - Fixed hash issue in Styles class https://github.com/Textualize/rich/pull/2346
 
 ## [12.4.4] - 2022-05-24
--- a/rich/console.py
+++ b/rich/console.py
@@ -1959,11 +1959,11 @@ class Console:
             del self._buffer[:]
             return
         with self._lock:
-            if self._buffer_index == 0:
+            if self.record:
+                with self._record_buffer_lock:
+                    self._record_buffer.extend(self._buffer[:])
 
-                if self.record:
-                    with self._record_buffer_lock:
-                        self._record_buffer.extend(self._buffer[:])
+            if self._buffer_index == 0:
 
                 if self.is_jupyter:  # pragma: no cover
                     from .jupyter import display

Test output

show
...................F
=================================== FAILURES ===================================
_______________________________ test_print_json ________________________________

    def test_print_json():
        console = Console(file=io.StringIO(), color_system="truecolor")
        console.print_json('[false, true, null, "foo"]', indent=4)
        result = console.file.getvalue()
        print(repr(result))
        expected = '\x1b[1m[\x1b[0m\n    \x1b[3;91mfalse\x1b[0m,\n    \x1b[3;92mtrue\x1b[0m,\n    \x1b[3;35mnull\x1b[0m,\n    \x1b[32m"foo"\x1b[0m\n\x1b[1m]\x1b[0m\n'
>       assert result == expected
E       AssertionError: assert '\x1b[1m[\x1b...[1m]\x1b[0m\n' == '\x1b[1m[\x1b...[1m]\x1b[0m\n'
E         
E           [
E         -     false,
E         ?        ---
E         +     false,
E         -     true,
E         ?        ---...
E         
E         ...Full output truncated (7 lines hidden), use '-vv' to show

tests/test_console.py:205: AssertionError
----------------------------- Captured stdout call -----------------------------
'\x1b[1m[\x1b[0m\n    \x1b[3mfalse\x1b[0m,\n    \x1b[3mtrue\x1b[0m,\n    \x1b[3mnull\x1b[0m,\n    "foo"\n\x1b[1m]\x1b[0m\n'
!!!!!!!!!!!!!!!!!!!!!!!!!! stopping after 1 failures !!!!!!!!!!!!!!!!!!!!!!!!!!!
1 failed, 19 passed in 0.19s