← mined_oracle

rich_2449

failed WRONG_FIX UNSUBMITTED wrong_fix_unsubmitted(None) · None tool calls · 0 s · Textualize/rich

Task input

(not found in data/tasks.jsonl)

Tool calls (0)

#ToolArgumentsResult
No trace captured.

Patch

--- a/CHANGELOG.md
+++ b/CHANGELOG.md
@@ -5,8 +5,13 @@ All notable changes to this project will be documented in this file.
 The format is based on [Keep a Changelog](https://keepachangelog.com/en/1.0.0/),
 and this project adheres to [Semantic Versioning](https://semver.org/spec/v2.0.0.html).
 
+
 ## [Unreleased]
 
+### Added
+
+- Add support for `FORCE_COLOR` env var https://github.com/Textualize/rich/pull/2449
+
 ### Fixed
 
 - Fix NO_COLOR support on legacy Windows https://github.com/Textualize/rich/pull/2458
--- a/rich/console.py
+++ b/rich/console.py
@@ -697,7 +697,12 @@ class Console:
         self._height = height
 
         self._color_system: Optional[ColorSystem]
-        self._force_terminal = force_terminal
+
+        if force_terminal is not None:
+            self._force_terminal = force_terminal
+        else:
+            self._force_terminal = self._environ.get("FORCE_COLOR") is not None
+
         self._file = file
         self.quiet = quiet
         self.stderr = stderr

Test output

show
...................F
=================================== FAILURES ===================================
_______________________________ test_print_json ________________________________

    def test_print_json():
        console = Console(file=io.StringIO(), color_system="truecolor")
        console.print_json('[false, true, null, "foo"]', indent=4)
        result = console.file.getvalue()
        print(repr(result))
        expected = '\x1b[1m[\x1b[0m\n    \x1b[3;91mfalse\x1b[0m,\n    \x1b[3;92mtrue\x1b[0m,\n    \x1b[3;35mnull\x1b[0m,\n    \x1b[32m"foo"\x1b[0m\n\x1b[1m]\x1b[0m\n'
>       assert result == expected
E       AssertionError: assert '\x1b[1m[\x1b...[1m]\x1b[0m\n' == '\x1b[1m[\x1b...[1m]\x1b[0m\n'
E         
E           [
E         -     false,
E         ?        ---
E         +     false,
E         -     true,
E         ?        ---...
E         
E         ...Full output truncated (7 lines hidden), use '-vv' to show

tests/test_console.py:205: AssertionError
----------------------------- Captured stdout call -----------------------------
'\x1b[1m[\x1b[0m\n    \x1b[3mfalse\x1b[0m,\n    \x1b[3mtrue\x1b[0m,\n    \x1b[3mnull\x1b[0m,\n    "foo"\n\x1b[1m]\x1b[0m\n'
!!!!!!!!!!!!!!!!!!!!!!!!!! stopping after 1 failures !!!!!!!!!!!!!!!!!!!!!!!!!!!
1 failed, 19 passed in 0.19s